Skip to content

chore(deps-dev): bump com.yugabyte:jdbc-yugabytedb from 42.3.5-yb-6 to 42.3.5-yb-7 #255

chore(deps-dev): bump com.yugabyte:jdbc-yugabytedb from 42.3.5-yb-6 to 42.3.5-yb-7

chore(deps-dev): bump com.yugabyte:jdbc-yugabytedb from 42.3.5-yb-6 to 42.3.5-yb-7 #255

Triggered via pull request September 19, 2024 10:33
Status Failure
Total duration 12s
Artifacts

label-pr.yml

on: pull_request
Fit to window
Zoom out
Zoom in

Annotations

12 errors
label
Label error: This PR is being prevented from merging because you have not added one of the labels: breakingChanges, newContributors, notableChanges, sdou, skipReleaseNotes, TypeBug, TypeEnhancement, TypeTest. You'll need to add it before this PR can be merged.
ContributedExtensionHarnessSuite ► liquibase.harness.change.ChangeObjectTests ► apply addCheckConstraint against yugabytedb 2.16: target/surefire-reports/TEST-ContributedExtensionHarnessSuite.xml#L0
Failed test found in: target/surefire-reports/TEST-ContributedExtensionHarnessSuite.xml Error: java.lang.AssertionError:
ContributedExtensionHarnessSuite ► liquibase.harness.change.ChangeObjectTests ► apply createFunction against yugabytedb 2.16: target/surefire-reports/TEST-ContributedExtensionHarnessSuite.xml#L0
Failed test found in: target/surefire-reports/TEST-ContributedExtensionHarnessSuite.xml Error: java.lang.AssertionError:
ContributedExtensionHarnessSuite ► liquibase.harness.change.ChangeObjectTests ► apply createPackage against yugabytedb 2.16: target/surefire-reports/TEST-ContributedExtensionHarnessSuite.xml#L0
Failed test found in: target/surefire-reports/TEST-ContributedExtensionHarnessSuite.xml Error: java.lang.AssertionError:
ContributedExtensionHarnessSuite ► liquibase.harness.change.ChangeObjectTests ► apply createPackageBody against yugabytedb 2.16: target/surefire-reports/TEST-ContributedExtensionHarnessSuite.xml#L0
Failed test found in: target/surefire-reports/TEST-ContributedExtensionHarnessSuite.xml Error: java.lang.AssertionError:
ContributedExtensionHarnessSuite ► liquibase.harness.change.ChangeObjectTests ► apply createProcedure against yugabytedb 2.16: target/surefire-reports/TEST-ContributedExtensionHarnessSuite.xml#L0
Failed test found in: target/surefire-reports/TEST-ContributedExtensionHarnessSuite.xml Error: Condition failed with Exception:
ContributedExtensionHarnessSuite ► liquibase.harness.change.ChangeObjectTests ► apply createProcedureFromFile against yugabytedb 2.16: target/surefire-reports/TEST-ContributedExtensionHarnessSuite.xml#L0
Failed test found in: target/surefire-reports/TEST-ContributedExtensionHarnessSuite.xml Error: Condition failed with Exception:
ContributedExtensionHarnessSuite ► liquibase.harness.change.ChangeObjectTests ► apply createTrigger against yugabytedb 2.16: target/surefire-reports/TEST-ContributedExtensionHarnessSuite.xml#L0
Failed test found in: target/surefire-reports/TEST-ContributedExtensionHarnessSuite.xml Error: java.lang.AssertionError:
ContributedExtensionHarnessSuite ► liquibase.harness.change.ChangeObjectTests ► apply createView against yugabytedb 2.16: target/surefire-reports/TEST-ContributedExtensionHarnessSuite.xml#L0
Failed test found in: target/surefire-reports/TEST-ContributedExtensionHarnessSuite.xml Error: Condition failed with Exception:
ContributedExtensionHarnessSuite ► liquibase.harness.change.ChangeObjectTests ► apply disableTrigger against yugabytedb 2.16: target/surefire-reports/TEST-ContributedExtensionHarnessSuite.xml#L0
Failed test found in: target/surefire-reports/TEST-ContributedExtensionHarnessSuite.xml Error: java.lang.AssertionError:
ContributedExtensionHarnessSuite ► liquibase.harness.change.ChangeObjectTests ► apply dropCheckConstraint against yugabytedb 2.16: target/surefire-reports/TEST-ContributedExtensionHarnessSuite.xml#L0
Failed test found in: target/surefire-reports/TEST-ContributedExtensionHarnessSuite.xml Error: java.lang.AssertionError:
ContributedExtensionHarnessSuite ► liquibase.harness.change.ChangeObjectTests ► apply dropFunction against yugabytedb 2.16: target/surefire-reports/TEST-ContributedExtensionHarnessSuite.xml#L0
Failed test found in: target/surefire-reports/TEST-ContributedExtensionHarnessSuite.xml Error: java.lang.AssertionError: